BDBM50057728 3,4,5-Trihydroxy-6-hydroxymethyl-tetrahydro-pyran-2-carboxylic acid methylamide::CHEMBL35946
SMILES CNC(=O)C1OC(CO)C(O)C(O)C1O
InChI Key InChIKey=GLOZHHWMZYAHBQ-UHFFFAOYSA-N
Data  2 KI
  Tab Delimited (TSV)   2D SDfile   Computed 3D by Vconf -m prep SDfile
Find this compound or compounds like it in BindingDB:
Activity Spreadsheet -- Enzyme Inhibition Constant Data from BindingDB
Found 2 hits for monomerid = 50057728
TargetGlycogen phosphorylase, brain form(Homo sapiens (Human))
University Of Perugia
Curated by ChEMBL
LigandPNGBDBM50057728(3,4,5-Trihydroxy-6-hydroxymethyl-tetrahydro-pyran-...)
Affinity DataKi:  1.60E+5nM. Assay description: Inhibition of rabbit glycogen phosphorylase B enzyme
In DepthDetails ArticlePubMed
TargetGlycogen phosphorylase, muscle form(Homo sapiens (Human))
University Of Alcala
Curated by ChEMBL
LigandPNGBDBM50057728(3,4,5-Trihydroxy-6-hydroxymethyl-tetrahydro-pyran-...)
Affinity DataKi:  3.80E+6nM. Assay description: Inhibitory activity against rabbit muscle glycogen phosphorylaseChecked by Author
In DepthDetails ArticlePubMed