BDBM50058033 CHEMBL3330787
SMILES Cl.CNCCNc1c2C(=O)c3ccccc3C(=O)c2c(NCCNC(N)=N)c2sccc12
InChI Key InChIKey=MOPDYEJHHJDWLK-UHFFFAOYSA-N
Data  2 IC50
  Tab Delimited (TSV)   2D SDfile   Computed 3D by Vconf -m prep SDfile
Find this compound or compounds like it in BindingDB:
Activity Spreadsheet -- Enzyme Inhibition Constant Data from BindingDB
Found 2 hits for monomerid = 50058033
TargetTelomerase reverse transcriptase(Homo sapiens (Human))
Russian Academy Of Sciences
Curated by ChEMBL
LigandPNGBDBM50058033(CHEMBL3330787)
Affinity DataIC50:  50nM. Assay description: Inhibition of human telomerase transfected in human HEK293T cells assessed as DNA extension using 5'-d(AATCCGTCGAGCAGAGTT)-3' substrate by Real-time ...
In DepthDetails ArticlePubMed
TargetTelomerase reverse transcriptase(Homo sapiens (Human))
Russian Academy Of Sciences
Curated by ChEMBL
LigandPNGBDBM50058033(CHEMBL3330787)
Affinity DataIC50:  1.10E+3nM. Assay description: Inhibition of human telomerase transfected in human HEK293T cells assessed as DNA extension using 5'-d(AATCCGTCGAGCAGAGTT)-3' substrate
In DepthDetails ArticlePubMed