BDBM50058069 CHEMBL3326993
SMILES COc1ccccc1N1CCN(CCCCCC(=O)NCc2ccccc2-c2ccccc2Cl)CC1
InChI Key InChIKey=IAKYDYYOYGXWAX-UHFFFAOYSA-N
Data  9 KI
  Tab Delimited (TSV)   2D SDfile   Computed 3D by Vconf -m prep SDfile
Find this compound or compounds like it in BindingDB:
Activity Spreadsheet -- Enzyme Inhibition Constant Data from BindingDB
Found 9 hits for monomerid = 50058069
Target5-hydroxytryptamine receptor 1B(Homo sapiens (Human))
Yonsei University
Curated by ChEMBL
LigandPNGBDBM50058069(CHEMBL3326993)
Affinity DataKi:  7nM. Assay description: Binding affinity to 5-HT1B (unknown origin)
In DepthDetails ArticlePubMed
Target5-hydroxytryptamine receptor 1A(Homo sapiens (Human))
Yonsei University
Curated by ChEMBL
LigandPNGBDBM50058069(CHEMBL3326993)
Affinity DataKi:  11nM. Assay description: Binding affinity to 5-HT1A (unknown origin)
In DepthDetails ArticlePubMed
Target5-hydroxytryptamine receptor 7(Homo sapiens (Human))
Yonsei University
Curated by ChEMBL
LigandPNGBDBM50058069(CHEMBL3326993)
Affinity DataKi:  16nM. Assay description: Displacement of [3H]LSD from 5-HT7R (unknown origin) expressed in CHO-K1 cells by liquid scintillation counting method
In DepthDetails ArticlePubMed
Target5-hydroxytryptamine receptor 2C(Homo sapiens (Human))
Yonsei University
Curated by ChEMBL
LigandPNGBDBM50058069(CHEMBL3326993)
Affinity DataKi:  70nM. Assay description: Binding affinity to 5-HT2C (unknown origin)
In DepthDetails ArticlePubMed
Target5-hydroxytryptamine receptor 2A(Homo sapiens (Human))
Yonsei University
Curated by ChEMBL
LigandPNGBDBM50058069(CHEMBL3326993)
Affinity DataKi:  77nM. Assay description: Binding affinity to 5-HT2A (unknown origin)
In DepthDetails ArticlePubMed
Target5-hydroxytryptamine receptor 1D(Homo sapiens (Human))
Yonsei University
Curated by ChEMBL
LigandPNGBDBM50058069(CHEMBL3326993)
Affinity DataKi:  122nM. Assay description: Binding affinity to 5-HT1D (unknown origin)
In DepthDetails ArticlePubMed
Target5-hydroxytryptamine receptor 5A(Homo sapiens (Human))
Yonsei University
Curated by ChEMBL
LigandPNGBDBM50058069(CHEMBL3326993)
Affinity DataKi:  517nM. Assay description: Binding affinity to 5-HT5A (unknown origin)
In DepthDetails ArticlePubMed
Target5-hydroxytryptamine receptor 6(Homo sapiens (Human))
Yonsei University
Curated by ChEMBL
LigandPNGBDBM50058069(CHEMBL3326993)
Affinity DataKi:  1.32E+3nM. Assay description: Binding affinity to 5-HT6 (unknown origin)
In DepthDetails ArticlePubMed
Target5-hydroxytryptamine receptor 3A(Homo sapiens (Human))
Yonsei University
Curated by ChEMBL
LigandPNGBDBM50058069(CHEMBL3326993)
Affinity DataKi: >1.00E+4nM. Assay description: Binding affinity to 5-HT3 (unknown origin)
In DepthDetails ArticlePubMed