BDBM50058071 CHEMBL3326991
SMILES COc1ccccc1N1CCN(CCCCC(=O)NCc2ccccc2-c2ccc(C)cc2)CC1
InChI Key InChIKey=MXBSUWFNWMJIRZ-UHFFFAOYSA-N
Data  1 KI
  Tab Delimited (TSV)   2D SDfile   Computed 3D by Vconf -m prep SDfile
Find this compound or compounds like it in BindingDB:
Activity Spreadsheet -- Enzyme Inhibition Constant Data from BindingDB
Found 1 hit for monomerid = 50058071
Target5-hydroxytryptamine receptor 7(Homo sapiens (Human))
Yonsei University
Curated by ChEMBL
LigandPNGBDBM50058071(CHEMBL3326991)
Affinity DataKi:  66nM. Assay description: Displacement of [3H]LSD from 5-HT7R (unknown origin) expressed in CHO-K1 cells by liquid scintillation counting method
In DepthDetails ArticlePubMed