BDBM50058464 2-Ethyl-1-(4-trifluoromethyl-phenyl)-isothiourea; hydrochloride::CHEMBL323542::CHEMBL542855
SMILES CCSC(N)=Nc1ccc(cc1)C(F)(F)F
InChI Key InChIKey=LCMOXIFARISMOH-UHFFFAOYSA-N
Data  4 KI
PDB links: 1 PDB ID matches this monomer.
  Tab Delimited (TSV)   2D SDfile   Computed 3D by Vconf -m prep SDfile
Find this compound or compounds like it in BindingDB:
Activity Spreadsheet -- Enzyme Inhibition Constant Data from BindingDB
Found 4 hits for monomerid = 50058464
TargetNitric oxide synthase, brain(Homo sapiens (Human))
Instituto De QuíMica MéDica
Curated by ChEMBL
LigandPNGBDBM50058464(2-Ethyl-1-(4-trifluoromethyl-phenyl)-isothiourea; ...)
Affinity DataKi:  320nM. Assay description: Inhibition of nNOS (unknown origin) assessed as conversion of L-[3H]arginine to L-[3H]citrulline
TargetNitric oxide synthase, brain(Homo sapiens (Human))
Instituto De QuíMica MéDica
Curated by ChEMBL
LigandPNGBDBM50058464(2-Ethyl-1-(4-trifluoromethyl-phenyl)-isothiourea; ...)
Affinity DataKi:  320nM. Assay description: Inhibitory activity against human neuronal nitric oxide synthase in brain (nNOS).
TargetNitric oxide synthase, endothelial(Homo sapiens (Human))
Glaxo Wellcome Research And Development
Curated by ChEMBL
LigandPNGBDBM50058464(2-Ethyl-1-(4-trifluoromethyl-phenyl)-isothiourea; ...)
Affinity DataKi:  9.40E+3nM. Assay description: Inhibitory activity against human vascular endothelial nitric oxide synthase.
In DepthDetails ArticlePubMed
TargetNitric oxide synthase, inducible(Homo sapiens (Human))
Glaxo Wellcome Research And Development
Curated by ChEMBL
LigandPNGBDBM50058464(2-Ethyl-1-(4-trifluoromethyl-phenyl)-isothiourea; ...)
Affinity DataKi:  3.70E+4nM. Assay description: Inhibitory activity against human inducible nitric oxide synthase (iNOS).
In DepthDetails ArticlePubMed