BDBM50058722 CHEMBL3326845
SMILES COc1cc2nc(Sc3sc(N)nc3C)n(-c3ccc(Oc4ccccc4)cc3)c(=O)c2cc1OC
InChI Key InChIKey=UKECACVWKSWQLE-UHFFFAOYSA-N
Data  1 IC50
  Tab Delimited (TSV)   2D SDfile   Computed 3D by Vconf -m prep SDfile
Find this compound or compounds like it in BindingDB:
Activity Spreadsheet -- Enzyme Inhibition Constant Data from BindingDB
Found 1 hit for monomerid = 50058722
TargetDihydrofolate reductase(Bos taurus (Cattle))
King Saud University
Curated by ChEMBL
LigandPNGBDBM50058722(CHEMBL3326845)
Affinity DataIC50:  6.00E+3nM. Assay description: Inhibition of bovine liver DHFR
In DepthDetails ArticlePubMed