BDBM50058763 CHEMBL3335418
SMILES C[C@H]1CN(Cc2ccc(cc2)C(=O)Nc2ccc(cc2)C(F)(F)F)CCN1Cc1cccnc1
InChI Key InChIKey=BAECAPJWZMSHMJ-IBGZPJMESA-N
Data  1 IC50
  Tab Delimited (TSV)   2D SDfile   Computed 3D by Vconf -m prep SDfile
Find this compound or compounds like it in BindingDB:
Activity Spreadsheet -- Enzyme Inhibition Constant Data from BindingDB
Found 1 hit for monomerid = 50058763
LigandPNGBDBM50058763(CHEMBL3335418)
Affinity DataIC50:  35nM. Assay description: Inhibition of HIF1 signaling in human U251 cells expressing VEGF by VEGF promoter-driven PLAP reporter gene assay
In DepthDetails ArticlePubMed