BDBM50058772 CHEMBL3335409
SMILES Ic1ccc(cc1)C(=O)Nc1ccc(CN2CCOCC2)cc1
InChI Key InChIKey=DEPFVTXHGVSVCN-UHFFFAOYSA-N
Data  1 IC50
  Tab Delimited (TSV)   2D SDfile   Computed 3D by Vconf -m prep SDfile
Find this compound or compounds like it in BindingDB:
Activity Spreadsheet -- Enzyme Inhibition Constant Data from BindingDB
Found 1 hit for monomerid = 50058772
LigandPNGBDBM50058772(CHEMBL3335409)
Affinity DataIC50:  2.50E+3nM. Assay description: Inhibition of HIF1 signaling in human U251 cells expressing VEGF by VEGF promoter-driven PLAP reporter gene assay
In DepthDetails ArticlePubMed