BDBM50058956 (R)-2-((R)-2-Acetylamino-3-phenyl-propionylamino)-5-guanidino-pentanoic acid [(R)-1-carbamoyl-2-(1H-indol-3-yl)-ethyl]-amide::CHEMBL66464
SMILES CC(=O)N[C@H](Cc1ccccc1)C(=O)N[C@H](CCCNC(N)=N)C(=O)N[C@H](Cc1c[nH]c2ccccc12)C(N)=O
InChI Key InChIKey=LUCUFURZWPZEOH-WXFUMESZSA-N
Data  4 IC50
  Tab Delimited (TSV)   2D SDfile   Computed 3D by Vconf -m prep SDfile
Find this compound or compounds like it in BindingDB:
Activity Spreadsheet -- Enzyme Inhibition Constant Data from BindingDB
Found 4 hits for monomerid = 50058956
TargetMelanocortin receptor 3(Homo sapiens (Human))
University Of Michigan Medical Center
Curated by ChEMBL
LigandPNGBDBM50058956((R)-2-((R)-2-Acetylamino-3-phenyl-propionylamino)-...)
Affinity DataIC50: >1.00E+4nM. Assay description: Displacement of [125I]NDP-MSH from Melanocortin 3 receptor at 10 uM
In DepthDetails ArticlePubMed
TargetMelanocortin receptor 4(Homo sapiens (Human))
University Of Michigan Medical Center
Curated by ChEMBL
LigandPNGBDBM50058956((R)-2-((R)-2-Acetylamino-3-phenyl-propionylamino)-...)
Affinity DataIC50: >1.00E+4nM. Assay description: Displacement of [125I]NDP-MSH from Melanocortin 4 receptor at 10 uM
In DepthDetails ArticlePubMed
TargetMelanocortin receptor 5(Homo sapiens (Human))
University Of Michigan Medical Center
Curated by ChEMBL
LigandPNGBDBM50058956((R)-2-((R)-2-Acetylamino-3-phenyl-propionylamino)-...)
Affinity DataIC50: >1.00E+4nM. Assay description: Displacement of [125I]NDP-MSH from Melanocortin 5 receptor at 10 uM
In DepthDetails ArticlePubMed
TargetMelanocyte-stimulating hormone receptor(Homo sapiens (Human))
University Of Michigan Medical Center
Curated by ChEMBL
LigandPNGBDBM50058956((R)-2-((R)-2-Acetylamino-3-phenyl-propionylamino)-...)
Affinity DataIC50: >1.00E+4nM. Assay description: Displacement of [125I]NDP-MSH from Melanocortin 1 receptor at 10 uM
In DepthDetails ArticlePubMed