BDBM50059018 (6aR,9aS)-5,6a,7,8,9,9a-Hexahydro-3(1H-imidazol-2-yl-methyl)-5-methyl-2-(phenylmethyl)cyclopent[4,5]imidazo[2,1-b]purin-4(3H)-one::CHEMBL303010
SMILES CN1C2=N[C@@H]3CCC[C@@H]3N2c2nc(Cc3ccccc3)n(Cc3ncc[nH]3)c2C1=O
InChI Key InChIKey=AVZGVMQOUWKHNB-CVEARBPZSA-N
Data  3 IC50
  Tab Delimited (TSV)   2D SDfile   Computed 3D by Vconf -m prep SDfile
Find this compound or compounds like it in BindingDB:
Activity Spreadsheet -- Enzyme Inhibition Constant Data from BindingDB
Found 3 hits for monomerid = 50059018
TargetPhosphodiesterase(Bos taurus)
Schering-Plough Research Institute
Curated by ChEMBL
LigandPNGBDBM50059018((6aR,9aS)-5,6a,7,8,9,9a-Hexahydro-3(1H-imidazol-2-...)
Affinity DataIC50:  1.10E+5nM. Assay description: Inhibitory activity against phosphodiesterase 3 (PDE3) purified from bovine heart
In DepthDetails ArticlePubMed
TargetcGMP-specific 3',5'-cyclic phosphodiesterase(Homo sapiens (Human))
Banasthali University
Curated by ChEMBL
LigandPNGBDBM50059018((6aR,9aS)-5,6a,7,8,9,9a-Hexahydro-3(1H-imidazol-2-...)
Affinity DataIC50:  4.00E+3nM. Assay description: Inhibition of PDE5 (unknown origin)
In DepthDetails ArticlePubMed
TargetcGMP-specific 3',5'-cyclic phosphodiesterase(Bos taurus)
Schering-Plough Research Institute
Curated by ChEMBL
LigandPNGBDBM50059018((6aR,9aS)-5,6a,7,8,9,9a-Hexahydro-3(1H-imidazol-2-...)
Affinity DataIC50:  4.00E+3nM. Assay description: Evaluated for inhibitory activity against Phosphodiesterase 5 (PDE5) purified from bovine lung
In DepthDetails ArticlePubMed