BDBM50059028 (6aR,9aS)-5,6a,7,8,9,9a-Hexahydro-2,5-dimethyl-cyclopent[4,5]imidazo[2,1-b]purin-4(3H)-one::2,5-dimethyl-(6aR,9aS)-3,4,5,8-tetrahydrocyclopenta[4,5]imidazo[2,1-b]purin-4-one::CHEMBL278644
SMILES CN1C2=N[C@@H]3CCC[C@@H]3N2c2nc(C)[nH]c2C1=O
InChI Key InChIKey=ARPIRHYHUOOCNG-SFYZADRCSA-N
Data  7 IC50
  Tab Delimited (TSV)   2D SDfile   Computed 3D by Vconf -m prep SDfile
Find this compound or compounds like it in BindingDB:
Activity Spreadsheet -- Enzyme Inhibition Constant Data from BindingDB
Found 7 hits for monomerid = 50059028
TargetPhosphodiesterase(Bos taurus)
Schering-Plough Research Institute
Curated by ChEMBL
LigandPNGBDBM50059028((6aR,9aS)-5,6a,7,8,9,9a-Hexahydro-2,5-dimethyl-cyc...)
Affinity DataIC50: >3.00E+5nM. Assay description: Inhibitory activity against phosphodiesterase 3 (PDE3) purified from bovine heart
In DepthDetails ArticlePubMed
TargetcGMP-dependent 3',5'-cyclic phosphodiesterase(Bos taurus)
Schering-Plough Research Institute
Curated by ChEMBL
LigandPNGBDBM50059028((6aR,9aS)-5,6a,7,8,9,9a-Hexahydro-2,5-dimethyl-cyc...)
Affinity DataIC50:  3.40E+4nM. Assay description: Inhibition of recombinant bovine adrenal cortex Phosphodiesterase 2 (PDE2)
In DepthDetails ArticlePubMed
TargetcGMP-specific 3',5'-cyclic phosphodiesterase(Bos taurus)
Schering-Plough Research Institute
Curated by ChEMBL
LigandPNGBDBM50059028((6aR,9aS)-5,6a,7,8,9,9a-Hexahydro-2,5-dimethyl-cyc...)
Affinity DataIC50:  2.40E+3nM. Assay description: Evaluated for inhibitory activity against Phosphodiesterase 5 (PDE5) purified from bovine lung
In DepthDetails ArticlePubMed
TargetcGMP-inhibited 3',5'-cyclic phosphodiesterase 3A/3B(Homo sapiens (Human))
Schering-Plough Research Institute
Curated by ChEMBL
LigandPNGBDBM50059028((6aR,9aS)-5,6a,7,8,9,9a-Hexahydro-2,5-dimethyl-cyc...)
Affinity DataIC50: >3.00E+5nM. Assay description: Optimum inhibitory concentration required to inhibit cGMP specific phosphodiesterase 3 (PDE3)
In DepthDetails ArticlePubMed
TargetcGMP-specific 3',5'-cyclic phosphodiesterase(Bos taurus)
Schering-Plough Research Institute
Curated by ChEMBL
LigandPNGBDBM50059028((6aR,9aS)-5,6a,7,8,9,9a-Hexahydro-2,5-dimethyl-cyc...)
Affinity DataIC50:  2.40E+3nM. Assay description: Optimum inhibitory concentration required to inhibit c-GMP specific Phosphodiesterase 5 (PDE5) of bovine lung
In DepthDetails ArticlePubMed
LigandPNGBDBM50059028((6aR,9aS)-5,6a,7,8,9,9a-Hexahydro-2,5-dimethyl-cyc...)
Affinity DataIC50:  1.25E+3nM. Assay description: Optimum inhibitory concentration required to inhibit c-GMP specific phosphodiesterase 1 (PDE1) of bovine aorta
In DepthDetails ArticlePubMed
TargetcGMP-specific 3',5'-cyclic phosphodiesterase(Homo sapiens (Human))
Banasthali University
Curated by ChEMBL
LigandPNGBDBM50059028((6aR,9aS)-5,6a,7,8,9,9a-Hexahydro-2,5-dimethyl-cyc...)
Affinity DataIC50:  2.40E+3nM. Assay description: Inhibition of PDE5 (unknown origin)
In DepthDetails ArticlePubMed