BDBM50059084 CHEMBL3393171::US10308663, Thienopyridone (5)
SMILES Nc1c[nH]c(=O)c2cc(sc12)-c1ccccc1
InChI Key InChIKey=FBVOPOZVLBHOHR-UHFFFAOYSA-N
Data  13 IC50
  Tab Delimited (TSV)   2D SDfile   Computed 3D by Vconf -m prep SDfile
Find this compound or compounds like it in BindingDB:
Activity Spreadsheet -- Enzyme Inhibition Constant Data from BindingDB
Found 13 hits for monomerid = 50059084
TargetProtein tyrosine phosphatase type IVA 1(Homo sapiens (Human))
European Molecular Biology Laboratory
Curated by ChEMBL
LigandPNGBDBM50059084(CHEMBL3393171 | US10308663, Thienopyridone (5))
Affinity DataIC50:  173nM. Assay description: Inhibition of full length human fusion His6 tagged PRL1 expressed in Escherichia coli using TAMRA-Thr-Ala-Asp-Ile-Tyr(PO3H2)-Glu-NH2 substrate by imm...
In DepthDetails ArticlePubMed
TargetProtein tyrosine phosphatase type IVA 2(Homo sapiens (Human))
European Molecular Biology Laboratory
Curated by ChEMBL
LigandPNGBDBM50059084(CHEMBL3393171 | US10308663, Thienopyridone (5))
Affinity DataIC50:  277nM. Assay description: Inhibition of human PRL2 expressed in Escherichia coli using TAMRA-Thr-Ala-Asp-Ile-Tyr(PO3H2)-Glu-NH2 substrate by immobilized metal ion affinity-bas...
In DepthDetails ArticlePubMed
TargetProtein tyrosine phosphatase type IVA 3(Homo sapiens (Human))
European Molecular Biology Laboratory
Curated by ChEMBL
LigandPNGBDBM50059084(CHEMBL3393171 | US10308663, Thienopyridone (5))
Affinity DataIC50:  128nM. Assay description: Inhibition of full length human fusion His6 tagged PRL3 expressed in Escherichia coli using TAMRA-Thr-Ala-Asp-Ile-Tyr(PO3H2)-Glu-NH2 substrate by imm...
In DepthDetails ArticlePubMed
TargetProtein tyrosine phosphatase type IVA 3(Homo sapiens (Human))
European Molecular Biology Laboratory
Curated by ChEMBL
LigandPNGBDBM50059084(CHEMBL3393171 | US10308663, Thienopyridone (5))
Affinity DataIC50:  240nM. Assay description: Inhibition of PRL3 (unknown origin) using DiFMUP as fluorogenic phosphate substrate assessed as DiFMUP dephosphorylation
In DepthDetails ArticlePubMed
TargetProtein tyrosine phosphatase type IVA 2(Homo sapiens (Human))
European Molecular Biology Laboratory
Curated by ChEMBL
LigandPNGBDBM50059084(CHEMBL3393171 | US10308663, Thienopyridone (5))
Affinity DataIC50:  1.04E+5nM. Assay description: Inhibition of PRL2 (unknown origin) using DiFMUP as fluorogenic phosphate substrate assessed as DiFMUP dephosphorylation
In DepthDetails ArticlePubMed
TargetProtein tyrosine phosphatase type IVA 1(Homo sapiens (Human))
European Molecular Biology Laboratory
Curated by ChEMBL
LigandPNGBDBM50059084(CHEMBL3393171 | US10308663, Thienopyridone (5))
Affinity DataIC50:  7.00E+4nM. Assay description: Inhibition of PRL1 (unknown origin) using DiFMUP as fluorogenic phosphate substrate assessed as DiFMUP dephosphorylation
In DepthDetails ArticlePubMed
TargetProtein tyrosine phosphatase type IVA 2(Homo sapiens (Human))
European Molecular Biology Laboratory
Curated by ChEMBL
LigandPNGBDBM50059084(CHEMBL3393171 | US10308663, Thienopyridone (5))
Affinity DataIC50:  130nM. Assay description: Inhibition of human His6-tagged PRL-2 expressed in Escherichia coli using TAMRA-Thr-Ala-Asp-Ile-Tyr(PO3H2)-Glu-NH2 peptide as substrate by IMAP-FP as...
In DepthDetails ArticlePubMed
TargetProtein tyrosine phosphatase type IVA 2(Homo sapiens (Human))
European Molecular Biology Laboratory
Curated by ChEMBL
LigandPNGBDBM50059084(CHEMBL3393171 | US10308663, Thienopyridone (5))
Affinity DataIC50:  280nM. Assay description: Inhibition of recombinant human His-6-tagged PTP4A2 expressed in Escherichia coli assessed as increase in polarization using TAMRAThr-Ala-Asp-Ile-Tyr...
In DepthDetails ArticlePubMed
TargetProtein tyrosine phosphatase type IVA 1(Homo sapiens (Human))
European Molecular Biology Laboratory
Curated by ChEMBL
LigandPNGBDBM50059084(CHEMBL3393171 | US10308663, Thienopyridone (5))
Affinity DataIC50:  170nM. Assay description: Inhibition of recombinant human His-6-tagged PTP4A1 expressed in Escherichia coli assessed as increase in polarization using TAMRAThr-Ala-Asp-Ile-Tyr...
In DepthDetails ArticlePubMed
TargetProtein tyrosine phosphatase type IVA 3(Homo sapiens (Human))
European Molecular Biology Laboratory
Curated by ChEMBL
LigandPNGBDBM50059084(CHEMBL3393171 | US10308663, Thienopyridone (5))
Affinity DataIC50:  130nM. Assay description: Inhibition of recombinant human His-6-tagged PTP4A3 expressed in Escherichia coli assessed as increase in polarization using TAMRAThr-Ala-Asp-Ile-Tyr...
In DepthDetails ArticlePubMed
TargetProtein tyrosine phosphatase type IVA 3(Homo sapiens (Human))
European Molecular Biology Laboratory
Curated by ChEMBL
LigandPNGBDBM50059084(CHEMBL3393171 | US10308663, Thienopyridone (5))
Affinity DataIC50:  460nM. Assay description: Inhibition of full-length human heart His6-tagged PRL-3 expressed in Escherichia coli using DiFMUP as substrate incubated for 35 mins by fluorescence...
In DepthDetails ArticlePubMed
TargetProtein tyrosine phosphatase type IVA 1(Homo sapiens (Human))
European Molecular Biology Laboratory
Curated by ChEMBL
LigandPNGBDBM50059084(CHEMBL3393171 | US10308663, Thienopyridone (5))
Affinity DataIC50:  130nM. Assay description: Inhibition of full-length human brain His6-tagged PRL-1 expressed in Escherichia coli using TAMRA-Thr-Ala-Asp-Ile-Tyr(PO3H2)-Glu-NH2 peptide as subst...
In DepthDetails ArticlePubMed
TargetProtein tyrosine phosphatase type IVA 3(Homo sapiens (Human))
European Molecular Biology Laboratory
Curated by ChEMBL
LigandPNGBDBM50059084(CHEMBL3393171 | US10308663, Thienopyridone (5))
Affinity DataIC50:  132nM. Assay description: The in vitro biochemical evaluation of all compounds was carried out using recombinant human PTP4A3, overexpressed as a His6-tag fusion protein in E....
In DepthDetails US Patent