BDBM50059183 CHEMBL3393292
SMILES Cc1ccccc1Oc1ccc(cc1)C(=O)NCc1ccncc1
InChI Key InChIKey=QLNOXJSKJFHDTG-UHFFFAOYSA-N
Data  3 IC50
  Tab Delimited (TSV)   2D SDfile   Computed 3D by Vconf -m prep SDfile
Find this compound or compounds like it in BindingDB:
Activity Spreadsheet -- Enzyme Inhibition Constant Data from BindingDB
Found 3 hits for monomerid = 50059183
TargetMitogen-activated protein kinase 14(Homo sapiens (Human))
Astrazeneca
Curated by ChEMBL
LigandPNGBDBM50059183(CHEMBL3393292)
Affinity DataIC50:  2.00E+3nM. Assay description: Inhibition of human recombinant 5'-c-myc, His6-tagged p38-alpha using MK2 (46 to 400) as substrate assessed as inhibition of phosphorylation after 60...
In DepthDetails ArticlePubMed
TargetMitogen-activated protein kinase 14(Homo sapiens (Human))
Astrazeneca
Curated by ChEMBL
LigandPNGBDBM50059183(CHEMBL3393292)
Affinity DataIC50: >1.00E+4nM. Assay description: Inhibition of p38-alpha (unknown origin) by p38alpha-MBP IoC assay
In DepthDetails ArticlePubMed
TargetMitogen-activated protein kinase 14(Homo sapiens (Human))
Astrazeneca
Curated by ChEMBL
LigandPNGBDBM50059183(CHEMBL3393292)
Affinity DataIC50:  5.40E+3nM. Assay description: Inhibition of human recombinant 5'-c-myc, His6-tagged p38-alpha using MSK1 as substrate assessed as inhibition of phosphorylation after 60 mins by EL...
In DepthDetails ArticlePubMed