BDBM50059214 CHEMBL3393308
SMILES Cc1cnc(Nc2cc(nc(C)n2)C2CCCN(C2)C(=O)c2ccccc2)s1
InChI Key InChIKey=BOWCRFQTJJGHST-UHFFFAOYSA-N
Data  1 KI  1 IC50
  Tab Delimited (TSV)   2D SDfile   Computed 3D by Vconf -m prep SDfile
Find this compound or compounds like it in BindingDB:
Activity Spreadsheet -- Enzyme Inhibition Constant Data from BindingDB
Found 2 hits for monomerid = 50059214
TargetMitogen-activated protein kinase kinase kinase 12(Homo sapiens (Human))
Genentech
Curated by ChEMBL
LigandPNGBDBM50059214(CHEMBL3393308)
Affinity DataKi:  35nM. Assay description: Inhibition of DLK (unknown origin)
In DepthDetails ArticlePubMed
TargetMitogen-activated protein kinase kinase kinase 12(Homo sapiens (Human))
Genentech
Curated by ChEMBL
LigandPNGBDBM50059214(CHEMBL3393308)
Affinity DataIC50:  641nM. Assay description: Inhibition of human DLK transfected in HEK293 cells assessed as JNK phosphorylation after 5.5 hrs by Hoechst-33342 staining-based assay
In DepthDetails ArticlePubMed