BDBM50059420 CHEMBL3393352::US9156845, 27
SMILES COCC1CCCN(C1)c1ncnc2[nH]cc(-c3cccc(c3)C#N)c12
InChI Key InChIKey=SGDNLMNAWOAVJR-UHFFFAOYSA-N
Data  4 IC50
  Tab Delimited (TSV)   2D SDfile   Computed 3D by Vconf -m prep SDfile
Find this compound or compounds like it in BindingDB:
Activity Spreadsheet -- Enzyme Inhibition Constant Data from BindingDB
Found 4 hits for monomerid = 50059420
TargetLeucine-rich repeat serine/threonine-protein kinase 2(Homo sapiens (Human))
Pfizer
US Patent
LigandPNGBDBM50059420(CHEMBL3393352 | US9156845, 27)
Affinity DataIC50:  95nMpH: 7.5Assay Description:LRRK2 kinase activity was measured using Lantha Screen technology from Invitrogen. GST-tagged truncated LRRK2 from Invitrogen (Cat # PV4874) was incu...
In DepthDetails US Patent
TargetLeucine-rich repeat serine/threonine-protein kinase 2(Homo sapiens (Human))
Pfizer
US Patent
LigandPNGBDBM50059420(CHEMBL3393352 | US9156845, 27)
Affinity DataIC50:  95nM. Assay description: Inhibition of GST-tagged truncated human recombinant LRRK2 using fluorescein-labeled LRRKtide peptide substrate incubated for 2 hrs
In DepthDetails ArticlePubMed
TargetLeucine-rich repeat serine/threonine-protein kinase 2(Homo sapiens (Human))
Pfizer
US Patent
LigandPNGBDBM50059420(CHEMBL3393352 | US9156845, 27)
Affinity DataIC50:  219nM. Assay description: Inhibition of GST-tagged truncated human recombinant LRRK2 G2019S mutant using fluorescein-labeled LRRKtide peptide substrate incubated for 90 mins
In DepthDetails ArticlePubMed
TargetLeucine-rich repeat serine/threonine-protein kinase 2 [G2019S](Homo sapiens (Human))
Pfizer
US Patent
LigandPNGBDBM50059420(CHEMBL3393352 | US9156845, 27)
Affinity DataIC50:  219nMpH: 7.5Assay Description:LRRK2 kinase activity was measured using Lantha Screen technology from Invitrogen. GST-tagged truncated LRRK2 from Invitrogen (Cat # PV4874) was incu...
In DepthDetails US Patent