BDBM50059520 1-[2-(3-Carboxymethyl-phenoxy)-ethyl]-3-dodecanoyl-1H-indole-2-carboxylic acid::CHEMBL91502
SMILES CCCCCCCCCCCC(=O)c1c(C(O)=O)n(CCOc2cccc(CC(O)=O)c2)c2ccccc12
InChI Key InChIKey=OSATYCHNKHIBHK-UHFFFAOYSA-N
Data  1 IC50
  Tab Delimited (TSV)   2D SDfile   Computed 3D by Vconf -m prep SDfile
Find this compound or compounds like it in BindingDB:
Activity Spreadsheet -- Enzyme Inhibition Constant Data from BindingDB
Found 1 hit for monomerid = 50059520
TargetCytosolic phospholipase A2(Bos taurus)
Ludwig-Maximilians University
Curated by ChEMBL
LigandPNGBDBM50059520(1-[2-(3-Carboxymethyl-phenoxy)-ethyl]-3-dodecanoyl...)
Affinity DataIC50:  1.60E+3nM. Assay description: Inhibitory activity against cPLA2 (cytosolic Phospholipase A2) by measuring the calcium ionophore A-23,187-induced arachidonic acid release from bovi...
In DepthDetails ArticlePubMed