BDBM50059530 3-(3-Dodecyloxy-benzoyl)-1-methyl-1H-indole-2-carboxylic acid::CHEMBL328567
SMILES CCCCCCCCCCCCOc1cccc(c1)C(=O)c1c(C(O)=O)n(C)c2ccccc12
InChI Key InChIKey=PPGPJRPUPZGQLM-UHFFFAOYSA-N
Data  1 IC50
  Tab Delimited (TSV)   2D SDfile   Computed 3D by Vconf -m prep SDfile
Find this compound or compounds like it in BindingDB:
Activity Spreadsheet -- Enzyme Inhibition Constant Data from BindingDB
Found 1 hit for monomerid = 50059530
TargetCytosolic phospholipase A2(Bos taurus)
Ludwig-Maximilians University
Curated by ChEMBL
LigandPNGBDBM50059530(3-(3-Dodecyloxy-benzoyl)-1-methyl-1H-indole-2-carb...)
Affinity DataIC50:  7.00E+3nM. Assay description: Inhibitory activity against cPLA2 (cytosolic Phospholipase A2) by measuring the calcium ionophore A-23,187-induced arachidonic acid release from bovi...
In DepthDetails ArticlePubMed