BDBM50059754 3-Methyl-4-phenyl-quinoline-2-carboxylic acid sec-butyl-methyl-amide::CHEMBL276756
SMILES CCC(C)N(C)C(=O)c1nc2ccccc2c(-c2ccccc2)c1C
InChI Key InChIKey=DNKULIGQSCRTMX-UHFFFAOYSA-N
Data  3 IC50
  Tab Delimited (TSV)   2D SDfile   Computed 3D by Vconf -m prep SDfile
Find this compound or compounds like it in BindingDB:
Activity Spreadsheet -- Enzyme Inhibition Constant Data from BindingDB
Found 3 hits for monomerid = 50059754
TargetTranslocator protein(Rattus norvegicus (rat))
Universit£
Curated by ChEMBL
LigandPNGBDBM50059754(3-Methyl-4-phenyl-quinoline-2-carboxylic acid sec-...)
Affinity DataIC50:  2.10nM. Assay description: In vitro binding affinity (pIC50) was tested against peripheral benzodiazepine receptor (PBR) in rat.
In DepthDetails ArticlePubMed
TargetTranslocator protein(Rattus norvegicus (rat))
Universit£
Curated by ChEMBL
LigandPNGBDBM50059754(3-Methyl-4-phenyl-quinoline-2-carboxylic acid sec-...)
Affinity DataIC50:  2.10nM. Assay description: Test in vitro, for potential ability to displace [3H]1 from PBR in rat brain cortex
In DepthDetails ArticlePubMed
TargetTranslocator protein(Rattus norvegicus (rat))
Universit£
Curated by ChEMBL
LigandPNGBDBM50059754(3-Methyl-4-phenyl-quinoline-2-carboxylic acid sec-...)
Affinity DataIC50:  2.10nM. Assay description: In vitro displacement of [3H]PK11195 from the peripheral benzodiazepine receptor (PBR) in rat cortex
In DepthDetails ArticlePubMed