BDBM50059794 (2R,6R)-3-((S)-2-Methoxy-propyl)-6,11,11-trimethyl-1,2,3,4,5,6-hexahydro-2,6-methano-benzo[d]azocin-7-ol::CHEMBL318314
SMILES CO[C@@H](C)CN1CC[C@@]2(C)c3c(O)cccc3C[C@@H]1C2(C)C
InChI Key InChIKey=ZWLVSTPPZRONRZ-CRFBAAHOSA-N
Data  1 KI
  Tab Delimited (TSV)   2D SDfile   Computed 3D by Vconf -m prep SDfile
Find this compound or compounds like it in BindingDB:
Activity Spreadsheet -- Enzyme Inhibition Constant Data from BindingDB
Found 1 hit for monomerid = 50059794
TargetMu-type opioid receptor(Rattus norvegicus (rat))
Boehringer Ingelheim Pharmaceuticals
Curated by ChEMBL
LigandPNGBDBM50059794((2R,6R)-3-((S)-2-Methoxy-propyl)-6,11,11-trimethyl...)
Affinity DataKi:  20.9nM. Assay description: Inhibition of [3H]-dihydromorphine binding to opioid receptor mu 1 in rat brain cortical membranes.
In DepthDetails ArticlePubMed