BDBM50059892 2-(6,7-Dimethoxy-2,3-dihydro-benzofuran-4-yl)-ethylamine::CHEMBL102347
SMILES COc1cc(CCN)c2CCOc2c1OC
InChI Key InChIKey=GGGQVCBWGWDHMQ-UHFFFAOYSA-N
Data  8 KI  2 EC50
  Tab Delimited (TSV)   2D SDfile   Computed 3D by Vconf -m prep SDfile
Find this compound or compounds like it in BindingDB:
Activity Spreadsheet -- Enzyme Inhibition Constant Data from BindingDB
Found 10 hits for monomerid = 50059892
Target5-hydroxytryptamine receptor 2C(Homo sapiens (Human))
Purdue University
Curated by ChEMBL
LigandPNGBDBM50059892(2-(6,7-Dimethoxy-2,3-dihydro-benzofuran-4-yl)-ethy...)
Affinity DataKi:  118nM. Assay description: Agonist activity at cloned human 5-hydroxytryptamine 2C receptor using [125I]-DOI radioligand
In DepthDetails ArticlePubMed
Target5-hydroxytryptamine receptor 2B(Homo sapiens (Human))
Purdue University
Curated by ChEMBL
LigandPNGBDBM50059892(2-(6,7-Dimethoxy-2,3-dihydro-benzofuran-4-yl)-ethy...)
Affinity DataKi:  311nM. Assay description: Antagonist activity at cloned human 5-hydroxytryptamine 2B receptor using [3H]-rauwolscine radioligand
In DepthDetails ArticlePubMed
Target5-hydroxytryptamine receptor 2A(Homo sapiens (Human))
Purdue University
Curated by ChEMBL
LigandPNGBDBM50059892(2-(6,7-Dimethoxy-2,3-dihydro-benzofuran-4-yl)-ethy...)
Affinity DataKi:  368nM. Assay description: Agonist activity at cloned human 5-hydroxytryptamine 2A receptor using [125I]-DOI radioligand
In DepthDetails ArticlePubMed
Target5-hydroxytryptamine receptor 2A(Homo sapiens (Human))
Purdue University
Curated by ChEMBL
LigandPNGBDBM50059892(2-(6,7-Dimethoxy-2,3-dihydro-benzofuran-4-yl)-ethy...)
Affinity DataKi:  368nM. Assay description: Agonist activity at cloned human 5-hydroxytryptamine 2A receptor using [125I]-DOI radioligand
In DepthDetails ArticlePubMed
Target5-hydroxytryptamine receptor 2B(Homo sapiens (Human))
Purdue University
Curated by ChEMBL
LigandPNGBDBM50059892(2-(6,7-Dimethoxy-2,3-dihydro-benzofuran-4-yl)-ethy...)
Affinity DataKi:  523nM. Assay description: Agonist activity at cloned human 5-hydroxytryptamine 2B receptor using [3H]-5-HT radioligand
In DepthDetails ArticlePubMed
Target5-hydroxytryptamine receptor 2C(Homo sapiens (Human))
Purdue University
Curated by ChEMBL
LigandPNGBDBM50059892(2-(6,7-Dimethoxy-2,3-dihydro-benzofuran-4-yl)-ethy...)
Affinity DataKi:  1.11E+3nM. Assay description: Antagonist activity at cloned human 5-hydroxytryptamine 2C receptor using [3H]-mesulergine radioligand
In DepthDetails ArticlePubMed
Target5-hydroxytryptamine receptor 2A(Rattus norvegicus (rat))
Purdue University
Curated by ChEMBL
LigandPNGBDBM50059892(2-(6,7-Dimethoxy-2,3-dihydro-benzofuran-4-yl)-ethy...)
Affinity DataKi:  2.50E+3nM. Assay description: Ability to displace [3H]-ketanserin from rat cortical homogenate 5-hydroxytryptamine 2A receptor
In DepthDetails ArticlePubMed
Target5-hydroxytryptamine receptor 1A(Rattus norvegicus (rat))
Purdue University
Curated by ChEMBL
LigandPNGBDBM50059892(2-(6,7-Dimethoxy-2,3-dihydro-benzofuran-4-yl)-ethy...)
Affinity DataKi:  6.20E+3nM. Assay description: Ability to displace [3H]-8-OH-DPAT from rat hippocampal homogenate 5-hydroxytryptamine 1A receptor
In DepthDetails ArticlePubMed
Target5-hydroxytryptamine receptor 2A(Rattus norvegicus (rat))
Purdue University
Curated by ChEMBL
LigandPNGBDBM50059892(2-(6,7-Dimethoxy-2,3-dihydro-benzofuran-4-yl)-ethy...)
Affinity DataEC50:  3.00E+3nM. Assay description: Effect on phosphoinositide hydrolysis in NIH 3T3 fibroblast expressing 5-hydroxytryptamine 2A receptor
In DepthDetails ArticlePubMed
Target5-hydroxytryptamine receptor 2C(Rattus norvegicus (Rat))
Purdue University
Curated by ChEMBL
LigandPNGBDBM50059892(2-(6,7-Dimethoxy-2,3-dihydro-benzofuran-4-yl)-ethy...)
Affinity DataEC50:  2.00E+3nM. Assay description: Effect on phosphoinositide hydrolysis in NIH 3T3 fibroblast 5-hydroxytryptamine 2C receptor
In DepthDetails ArticlePubMed