BDBM50060124 2-[6-Chloro-2-(4-chloro-phenyl)-imidazo[1,2-a]pyridin-3-yl]-1-pyrrolidin-1-yl-ethanone::CHEMBL317473
SMILES Clc1ccc(cc1)-c1nc2ccc(Cl)cn2c1CC(=O)N1CCCC1
InChI Key InChIKey=RFVUCJJSCWRYIR-UHFFFAOYSA-N
Data  1 IC50  1 EC50
  Tab Delimited (TSV)   2D SDfile   Computed 3D by Vconf -m prep SDfile
Find this compound or compounds like it in BindingDB:
Activity Spreadsheet -- Enzyme Inhibition Constant Data from BindingDB
Found 2 hits for monomerid = 50060124
TargetGamma-aminobutyric acid receptor subunit alpha-2/beta-2/gamma-2(Homo sapiens (Human))
Universit£
Curated by ChEMBL
LigandPNGBDBM50060124(2-[6-Chloro-2-(4-chloro-phenyl)-imidazo[1,2-a]pyri...)
Affinity DataEC50:  6.60E+9nM. Assay description: Potentiation of GABA-evoked Cl- currents in Xenopus oocytes expressing human alpha-2-beta-2-gamma-2 subunits
In DepthDetails ArticlePubMed
TargetTranslocator protein(Rattus norvegicus (rat))
Universit£
Curated by ChEMBL
LigandPNGBDBM50060124(2-[6-Chloro-2-(4-chloro-phenyl)-imidazo[1,2-a]pyri...)
Affinity DataIC50:  287nM. Assay description: Displacement of Ro 5-4864 from peripheral (renal cell) Benzodiazepine receptor
In DepthDetails ArticlePubMed