BDBM50060331 CHEMBL412744::bis-[4-tert-Butyl-2-[5-tert-butyl-3-(5-tert-butyl-2-carboxymethoxy-benzyl)-2-carboxymethoxy-benzyl]-6-(5-tert-butyl-2-carboxymethoxy-benzyl)-phenoxy]-acetic acid
SMILES CC(C)(C)c1cc2Cc3cc(cc(Cc4cc(cc(Cc5cc(cc(Cc6cc(cc(Cc7cc(cc(Cc8cc(cc(Cc9cc(cc(Cc(c1)c2OCC(O)=O)c9OCC(O)=O)C(C)(C)C)c8OCC(O)=O)C(C)(C)C)c7OCC(O)=O)C(C)(C)C)c6OCC(O)=O)C(C)(C)C)c5OCC(O)=O)C(C)(C)C)c4OCC(O)=O)C(C)(C)C)c3OCC(O)=O)C(C)(C)C
InChI Key InChIKey=DKYCTMCMDDFTPP-UHFFFAOYSA-N
Data  1 KI
  Tab Delimited (TSV)   2D SDfile   Computed 3D by Vconf -m prep SDfile
Find this compound or compounds like it in BindingDB:
Activity Spreadsheet -- Enzyme Inhibition Constant Data from BindingDB
Found 1 hit for monomerid = 50060331
TargetNeutrophil elastase(Homo sapiens (Human))
RhôNe-Poulenc Rorer
Curated by ChEMBL
LigandPNGBDBM50060331(CHEMBL412744 | bis-[4-tert-Butyl-2-[5-tert-butyl-3...)
Affinity DataKi:  1.30E+3nM. Assay description: Inhibitory activity against human leukocyte elastase
In DepthDetails ArticlePubMed