BDBM50060442 CHEMBL333089::N-[3-(2-{4-[3-(5-[1,2,4]Triazol-4-yl-1H-indol-3-yl)-propyl]-piperazin-1-yl}-ethyl)-phenyl]-acetamide
SMILES CC(=O)Nc1cccc(CCN2CCN(CCCc3c[nH]c4ccc(cc34)-n3cnnc3)CC2)c1
InChI Key InChIKey=FXQIFPJUNZCNRZ-UHFFFAOYSA-N
Data  2 IC50  1 EC50
  Tab Delimited (TSV)   2D SDfile   Computed 3D by Vconf -m prep SDfile
Find this compound or compounds like it in BindingDB:
Activity Spreadsheet -- Enzyme Inhibition Constant Data from BindingDB
Found 3 hits for monomerid = 50060442
Target5-hydroxytryptamine receptor 1D(Homo sapiens (Human))
Merck Sharp And Dohme Research Laboratories
Curated by ChEMBL
LigandPNGBDBM50060442(CHEMBL333089 | N-[3-(2-{4-[3-(5-[1,2,4]Triazol-4-y...)
Affinity DataIC50:  1.80nM. Assay description: Displacement of [3H]-5-HT from human 5-hydroxytryptamine 1D receptor expressed in CHO cells
In DepthDetails ArticlePubMed
Target5-hydroxytryptamine receptor 1D(Homo sapiens (Human))
Merck Sharp And Dohme Research Laboratories
Curated by ChEMBL
LigandPNGBDBM50060442(CHEMBL333089 | N-[3-(2-{4-[3-(5-[1,2,4]Triazol-4-y...)
Affinity DataEC50:  1.60nM. Assay description: Stimulation of [35S]-GTP-gammaS, binding in CHO cells expressing 5-hydroxytryptamine 1D receptor
In DepthDetails ArticlePubMed
Target5-hydroxytryptamine receptor 1B(Homo sapiens (Human))
Merck Sharp And Dohme Research Laboratories
Curated by ChEMBL
LigandPNGBDBM50060442(CHEMBL333089 | N-[3-(2-{4-[3-(5-[1,2,4]Triazol-4-y...)
Affinity DataIC50:  170nM. Assay description: Displacement of [3H]-5-HT from human 5-hydroxytryptamine 1B receptor expressed in CHO cells
In DepthDetails ArticlePubMed