BDBM50060972 3',5'-Dichloro-biphenyl-4-carboxylic acid::CHEMBL106590
SMILES OC(=O)c1ccc(cc1)-c1cc(Cl)cc(Cl)c1
InChI Key InChIKey=IFTKERBYCONAST-UHFFFAOYSA-N
Data  1 Kd  3 EC50
  Tab Delimited (TSV)   2D SDfile   Computed 3D by Vconf -m prep SDfile
Find this compound or compounds like it in BindingDB:
Activity Spreadsheet -- Enzyme Inhibition Constant Data from BindingDB
Found 4 hits for monomerid = 50060972
TargetRegulatory protein E2(Human papillomavirus type 16)
Abbott Laboratories
Curated by ChEMBL
LigandPNGBDBM50060972(3',5'-Dichloro-biphenyl-4-carboxylic acid | CHEMBL...)
Affinity DataKd:  6.00E+4nM. Assay description: Dissociation constant after binding to human papillomavirus E2 DNA-binding domain (DBD) by observing the changes in [15N]-HSQC spectra.
In DepthDetails ArticlePubMed
TargetRetinoic acid receptor RXR-gamma(Homo sapiens (Human))
Goethe-University Frankfurt
Curated by ChEMBL
LigandPNGBDBM50060972(3',5'-Dichloro-biphenyl-4-carboxylic acid | CHEMBL...)
Affinity DataEC50: >3.00E+4nM. Assay description: Agonist activity at Gal4-LBD fused RXRgamma (unknown origin) expressed in HEK293T cells after 14 to 16 hrs by dual-Glo luciferase assay
In DepthDetails ArticlePubMed
TargetRetinoic acid receptor RXR-alpha(Homo sapiens (Human))
Goethe-University Frankfurt
Curated by ChEMBL
LigandPNGBDBM50060972(3',5'-Dichloro-biphenyl-4-carboxylic acid | CHEMBL...)
Affinity DataEC50:  9.30E+3nM. Assay description: Agonist activity at Gal4-LBD fused RXRalpha (unknown origin) expressed in HEK293T cells after 14 to 16 hrs by dual-Glo luciferase assay
In DepthDetails ArticlePubMed
TargetRetinoic acid receptor RXR-beta(Homo sapiens (Human))
Goethe-University Frankfurt
Curated by ChEMBL
LigandPNGBDBM50060972(3',5'-Dichloro-biphenyl-4-carboxylic acid | CHEMBL...)
Affinity DataEC50:  1.30E+4nM. Assay description: Agonist activity at Gal4-LBD fused RXRbeta (unknown origin) expressed in HEK293T cells after 14 to 16 hrs by dual-Glo luciferase assay
In DepthDetails ArticlePubMed