BDBM50061011 CHEMBL3393553
SMILES CN[C@@H]1CCN(C1)c1cnnc(NC2CCCC2)c1
InChI Key InChIKey=QLDXTDXXBCKZJH-GFCCVEGCSA-N
Data  1 KI
  Tab Delimited (TSV)   2D SDfile   Computed 3D by Vconf -m prep SDfile
Find this compound or compounds like it in BindingDB:
Activity Spreadsheet -- Enzyme Inhibition Constant Data from BindingDB
Found 1 hit for monomerid = 50061011
TargetHistamine H4 receptor(Homo sapiens (Human))
Janssen Research And Development
Curated by ChEMBL
LigandPNGBDBM50061011(CHEMBL3393553)
Affinity DataKi:  6nM. Assay description: Displacement of [3H]histamine from human recombinant histamine H4 receptor
In DepthDetails ArticlePubMed