BDBM50061126 CHEMBL3393533
SMILES CN[C@H]1CCN(C1)c1ccnc(NC2CCCC2)c1
InChI Key InChIKey=FYWWTWHYFTWIRD-ZDUSSCGKSA-N
Data  1 KI  1 EC50
  Tab Delimited (TSV)   2D SDfile   Computed 3D by Vconf -m prep SDfile
Find this compound or compounds like it in BindingDB:
Activity Spreadsheet -- Enzyme Inhibition Constant Data from BindingDB
Found 2 hits for monomerid = 50061126
TargetHistamine H4 receptor(Homo sapiens (Human))
Janssen Research And Development
Curated by ChEMBL
LigandPNGBDBM50061126(CHEMBL3393533)
Affinity DataKi:  33nM. Assay description: Displacement of [3H]histamine from human recombinant histamine H4 receptor
In DepthDetails ArticlePubMed
TargetHistamine H4 receptor(Homo sapiens (Human))
Janssen Research And Development
Curated by ChEMBL
LigandPNGBDBM50061126(CHEMBL3393533)
Affinity DataEC50: >1.00E+4nM. Assay description: Agonist activity at human recombinant histamine H4 receptor expressed in SK-N-MC cells assessed as effect on forskolin-stimulated cAMP-mediated repor...
In DepthDetails ArticlePubMed