BDBM50061324 (2-p-Tolyloxy-ethyl)-(3-o-tolyloxy-propyl)-amine::CHEMBL334545
SMILES Cc1ccc(OCCNCCCOc2ccccc2C)cc1
InChI Key InChIKey=DGFGHVHKQCWUJA-UHFFFAOYSA-N
Data  6 KI
  Tab Delimited (TSV)   2D SDfile   Computed 3D by Vconf -m prep SDfile
Find this compound or compounds like it in BindingDB:
Activity Spreadsheet -- Enzyme Inhibition Constant Data from BindingDB
Found 6 hits for monomerid = 50061324
TargetD(4) dopamine receptor(Homo sapiens (Human))
Warner-Lambert
Curated by ChEMBL
LigandPNGBDBM50061324((2-p-Tolyloxy-ethyl)-(3-o-tolyloxy-propyl)-amine |...)
Affinity DataKi:  1.10nM. Assay description: Binding affinity to recombinant human dopamine receptor D4 expressed in CHO cells by displacement of [3H]-spiperone
In DepthDetails ArticlePubMed
TargetD(4) dopamine receptor(Homo sapiens (Human))
Warner-Lambert
Curated by ChEMBL
LigandPNGBDBM50061324((2-p-Tolyloxy-ethyl)-(3-o-tolyloxy-propyl)-amine |...)
Affinity DataKi:  1.10nM. Assay description: Binding affinity to displace [3H]spiperone from cloned human dopamine receptor D4 was determined
In DepthDetails ArticlePubMed
TargetD(2) dopamine receptor(Homo sapiens (Human))
Pomona College
Curated by ChEMBL
LigandPNGBDBM50061324((2-p-Tolyloxy-ethyl)-(3-o-tolyloxy-propyl)-amine |...)
Affinity DataKi:  295nM. Assay description: Binding affinity to displace [3H]spiperone from cloned human dopamine receptor D2 was determined
In DepthDetails ArticlePubMed
TargetD(2) dopamine receptor(Homo sapiens (Human))
Pomona College
Curated by ChEMBL
LigandPNGBDBM50061324((2-p-Tolyloxy-ethyl)-(3-o-tolyloxy-propyl)-amine |...)
Affinity DataKi:  296nM. Assay description: Binding affinity against cloned human dopamine receptor D2 expressed in Chinese hamster ovary (CHO) K-1 cells by displacement of [3H]-spiperone.
In DepthDetails ArticlePubMed
TargetD(3) dopamine receptor(Homo sapiens (Human))
Pomona College
Curated by ChEMBL
LigandPNGBDBM50061324((2-p-Tolyloxy-ethyl)-(3-o-tolyloxy-propyl)-amine |...)
Affinity DataKi:  380nM. Assay description: Binding affinity to displace [3H]spiperone from cloned human dopamine receptor D3 was determined
In DepthDetails ArticlePubMed
TargetD(3) dopamine receptor(Homo sapiens (Human))
Pomona College
Curated by ChEMBL
LigandPNGBDBM50061324((2-p-Tolyloxy-ethyl)-(3-o-tolyloxy-propyl)-amine |...)
Affinity DataKi:  381nM. Assay description: Binding affinity against cloned human dopamine receptor D3 expressed in Chinese hamster ovary (CHO) K-1 cells by displacement of [3H]-spiperone.
In DepthDetails ArticlePubMed