BDBM50061401 CHEMBL3393889
SMILES OC(=O)c1cccc(c1)C(=O)Nc1nc2ccccc2n1CCN1CCCC1
InChI Key InChIKey=MJSKEDRBWNTDDQ-UHFFFAOYSA-N
Data  1 EC50
  Tab Delimited (TSV)   2D SDfile   Computed 3D by Vconf -m prep SDfile
Find this compound or compounds like it in BindingDB:
Activity Spreadsheet -- Enzyme Inhibition Constant Data from BindingDB
Found 1 hit for monomerid = 50061401
TargetKappa-type opioid receptor(Homo sapiens (Human))
Dr. Reddy'S Laboratories
Curated by ChEMBL
LigandPNGBDBM50061401(CHEMBL3393889)
Affinity DataEC50: >1.00E+4nM. Assay description: Agonist activity at human kappa opioid receptor expressed in COS7 cells after 60 mins IP1 assay
In DepthDetails ArticlePubMed