BDBM50061441 1-[4-(8-Chloro-6,11-dihydro-5H-benzo[5,6]cyclohepta[1,2-b]pyridin-11-yl)-piperazin-1-yl]-2-pyridin-4-yl-ethanone::CHEMBL311310
SMILES Clc1ccc2C(N3CCN(CC3)C(=O)Cc3ccncc3)c3ncccc3CCc2c1
InChI Key InChIKey=QIVUVRPLLRMTDC-UHFFFAOYSA-N
Data  7 IC50
  Tab Delimited (TSV)   2D SDfile   Computed 3D by Vconf -m prep SDfile
Find this compound or compounds like it in BindingDB:
Activity Spreadsheet -- Enzyme Inhibition Constant Data from BindingDB
Found 7 hits for monomerid = 50061441
TargetDimer of Protein farnesyltransferase subunit beta(Homo sapiens (Human))
Schering-Plough Research Institute
Curated by ChEMBL
LigandPNGBDBM50061441(1-[4-(8-Chloro-6,11-dihydro-5H-benzo[5,6]cyclohept...)
Affinity DataIC50:  14nM. Assay description: Inhibitory activity against recombinant human farnesyltransferase
In DepthDetails ArticlePubMed
TargetDimer of Protein farnesyltransferase subunit beta(Homo sapiens (Human))
Schering-Plough Research Institute
Curated by ChEMBL
LigandPNGBDBM50061441(1-[4-(8-Chloro-6,11-dihydro-5H-benzo[5,6]cyclohept...)
Affinity DataIC50:  160nM. Assay description: In vitro inhibition of farnesyltransferase farnesylation of the H-ras oncogene
In DepthDetails ArticlePubMed
TargetDimer of Protein farnesyltransferase subunit beta(Homo sapiens (Human))
Schering-Plough Research Institute
Curated by ChEMBL
LigandPNGBDBM50061441(1-[4-(8-Chloro-6,11-dihydro-5H-benzo[5,6]cyclohept...)
Affinity DataIC50:  3.70E+3nM. Assay description: Inhibition of Farnesyltransferase from Ras-CVLS or Ras-CVLL in Cos-7 monkey kidney cells
In DepthDetails ArticlePubMed
TargetProtein farnesyltransferase subunit beta/geranylgeranyltransferase type-1 subunit alpha(Homo sapiens (Human))
Schering-Plough Research Institute
Curated by ChEMBL
LigandPNGBDBM50061441(1-[4-(8-Chloro-6,11-dihydro-5H-benzo[5,6]cyclohept...)
Affinity DataIC50:  36nM. Assay description: In vitro FPT potency by measuring the ability to inhibit the transfer of [3H]-farnesyl from farnesyl pyrophosphate to H-Ras-CLVS.
In DepthDetails ArticlePubMed
TargetDimer of Protein farnesyltransferase/geranylgeranyltransferase type-1 subunit alpha(Rattus norvegicus (rat))
Schering-Plough Research Institute
Curated by ChEMBL
LigandPNGBDBM50061441(1-[4-(8-Chloro-6,11-dihydro-5H-benzo[5,6]cyclohept...)
Affinity DataIC50: >4.60E+4nM. Assay description: Inhibition of rat Geranylgeranyl transferase (GGPT)
In DepthDetails ArticlePubMed
TargetProtein farnesyltransferase subunit beta/geranylgeranyltransferase type-1 subunit alpha(Homo sapiens (Human))
Schering-Plough Research Institute
Curated by ChEMBL
LigandPNGBDBM50061441(1-[4-(8-Chloro-6,11-dihydro-5H-benzo[5,6]cyclohept...)
Affinity DataIC50:  3.70E+3nM. Assay description: In vitro inhibition of Ras processing in COS cells
In DepthDetails ArticlePubMed
TargetDimer of Protein farnesyltransferase subunit beta(Homo sapiens (Human))
Schering-Plough Research Institute
Curated by ChEMBL
LigandPNGBDBM50061441(1-[4-(8-Chloro-6,11-dihydro-5H-benzo[5,6]cyclohept...)
Affinity DataIC50:  14nM. Assay description: Inhibitory activity against recombinant human farnesyltransferase
In DepthDetails ArticlePubMed