BDBM50061499 (S)-2-Acetylamino-N*1*-(3,3,3-trifluoro-1-methyl-2-oxo-propyl)-succinamide::CHEMBL130155
SMILES CC(NC(=O)[C@H](CC(N)=O)NC(C)=O)C(=O)C(F)(F)F
InChI Key InChIKey=RMECTDDZBITWFK-RZKHNPSRSA-N
Data  1 IC50
  Tab Delimited (TSV)   2D SDfile   Computed 3D by Vconf -m prep SDfile
Find this compound or compounds like it in BindingDB:
Activity Spreadsheet -- Enzyme Inhibition Constant Data from BindingDB
Found 1 hit for monomerid = 50061499
TargetGenome polyprotein(Human rhinovirus B)
Boehringer Ingelheim
Curated by ChEMBL
LigandPNGBDBM50061499((S)-2-Acetylamino-N*1*-(3,3,3-trifluoro-1-methyl-2...)
Affinity DataIC50: >3.00E+5nM. Assay description: Micro molar potency of the compound to inhibit human cytomegalovirus (HCMV) protease
In DepthDetails ArticlePubMed