BDBM50061501 (S)-2-((S)-2-Amino-3,3-dimethyl-butyrylamino)-N*4*,N*4*-dimethyl-N*1*-(3,3,3-trifluoro-1-methyl-2-oxo-propyl)-succinamide::CHEMBL132823
SMILES CC(NC(=O)[C@H](CC(=O)N(C)C)NC(=O)[C@@H](N)C(C)(C)C)C(=O)C(F)(F)F
InChI Key InChIKey=QVCSHRPXSKDNHL-CAWIPBJDSA-N
Data  1 IC50
  Tab Delimited (TSV)   2D SDfile   Computed 3D by Vconf -m prep SDfile
Find this compound or compounds like it in BindingDB:
Activity Spreadsheet -- Enzyme Inhibition Constant Data from BindingDB
Found 1 hit for monomerid = 50061501
TargetGenome polyprotein(Human rhinovirus B)
Boehringer Ingelheim
Curated by ChEMBL
LigandPNGBDBM50061501((S)-2-((S)-2-Amino-3,3-dimethyl-butyrylamino)-N*4*...)
Affinity DataIC50:  1.20E+4nM. Assay description: Micro molar potency of the compound to inhibit human cytomegalovirus (HCMV) protease
In DepthDetails ArticlePubMed