BDBM50061514 (S)-2-[(S)-2-((S)-2-Acetylamino-3-methyl-butyrylamino)-butyrylamino]-N*4*,N*4*-dimethyl-N*1*-(3,3,3-trifluoro-1-methyl-2-oxo-propyl)-succinamide::CHEMBL131633
SMILES CC[C@H](NC(=O)[C@@H](NC(C)=O)C(C)C)C(=O)N[C@@H](CC(=O)N(C)C)C(=O)NC(C)C(=O)C(F)(F)F
InChI Key InChIKey=JGBXQUVWHQMUKA-LJLKZGIISA-N
Data  1 IC50
  Tab Delimited (TSV)   2D SDfile   Computed 3D by Vconf -m prep SDfile
Find this compound or compounds like it in BindingDB:
Activity Spreadsheet -- Enzyme Inhibition Constant Data from BindingDB
Found 1 hit for monomerid = 50061514
TargetGenome polyprotein(Human rhinovirus B)
Boehringer Ingelheim
Curated by ChEMBL
LigandPNGBDBM50061514((S)-2-[(S)-2-((S)-2-Acetylamino-3-methyl-butyrylam...)
Affinity DataIC50:  4.40E+3nM. Assay description: Micro molar potency of the compound to inhibit human cytomegalovirus (HCMV) protease
In DepthDetails ArticlePubMed