BDBM50061521 (S)-2-{(S)-2-[(S)-2-((S)-2-Acetylamino-2-hydroxy-acetylamino)-3-(4-hydroxy-phenyl)-propionylamino]-3-methyl-butyrylamino}-6-amino-hexanoic acid (3,3,3-trifluoro-1-methyl-2-oxo-propyl)-amide::CHEMBL132567
SMILES CC(C)[C@H](NC(=O)[C@H](Cc1ccc(O)cc1)NC(=O)[C@H](O)NC(C)=O)C(=O)N[C@@H](CCCCN)C(=O)NC(C)C(=O)C(F)(F)F
InChI Key InChIKey=BHODULYNBCEZDW-CKPDMFRUSA-N
Data  1 IC50
  Tab Delimited (TSV)   2D SDfile   Computed 3D by Vconf -m prep SDfile
Find this compound or compounds like it in BindingDB:
Activity Spreadsheet -- Enzyme Inhibition Constant Data from BindingDB
Found 1 hit for monomerid = 50061521
TargetGenome polyprotein(Human rhinovirus B)
Boehringer Ingelheim
Curated by ChEMBL
LigandPNGBDBM50061521((S)-2-{(S)-2-[(S)-2-((S)-2-Acetylamino-2-hydroxy-a...)
Affinity DataIC50:  2.60E+3nM. Assay description: Micro molar potency of the compound to inhibit human cytomegalovirus (HCMV) protease
In DepthDetails ArticlePubMed