BDBM50061540 (S)-2-[(S)-3,3-Dimethyl-2-(3-methyl-butyrylamino)-butyrylamino]-N*4*,N*4*-dimethyl-N*1*-(3,3,3-trifluoro-1-methyl-2-oxo-propyl)-succinamide::CHEMBL335100
SMILES CC(C)CC(=O)N[C@H](C(=O)N[C@@H](CC(=O)N(C)C)C(=O)NC(C)C(=O)C(F)(F)F)C(C)(C)C
InChI Key InChIKey=ATSSHNJAIAVZPM-XBUJOUKBSA-N
Data  1 IC50
  Tab Delimited (TSV)   2D SDfile   Computed 3D by Vconf -m prep SDfile
Find this compound or compounds like it in BindingDB:
Activity Spreadsheet -- Enzyme Inhibition Constant Data from BindingDB
Found 1 hit for monomerid = 50061540
TargetGenome polyprotein(Human rhinovirus B)
Boehringer Ingelheim
Curated by ChEMBL
LigandPNGBDBM50061540((S)-2-[(S)-3,3-Dimethyl-2-(3-methyl-butyrylamino)-...)
Affinity DataIC50:  1.40E+3nM. Assay description: Micro molar potency of the compound to inhibit human cytomegalovirus (HCMV) protease
In DepthDetails ArticlePubMed