BDBM50061609 CHEMBL3394074::US9321756, 206
SMILES CC(C)Nc1cncc(n1)-c1c[nH]c2ccc(cc12)-c1nnc(N)s1
InChI Key InChIKey=SXGXDOZGWJTWBA-UHFFFAOYSA-N
Data  8 IC50
  Tab Delimited (TSV)   2D SDfile   Computed 3D by Vconf -m prep SDfile
Find this compound or compounds like it in BindingDB:
Activity Spreadsheet -- Enzyme Inhibition Constant Data from BindingDB
Found 8 hits for monomerid = 50061609
TargetSerine/threonine-protein kinase pim-3(Homo sapiens (Human))
Amgen
US Patent
LigandPNGBDBM50061609(CHEMBL3394074 | US9321756, 206)
Affinity DataIC50:  1.15nM. Assay description: The assay for the determination of Pim activity is based on the formation of phosphorylated biotinylated-BAD peptide at the Serine 112 residue (S112)...
In DepthDetails US Patent
TargetSerine/threonine-protein kinase pim-1(Homo sapiens (Human))
Amgen
US Patent
LigandPNGBDBM50061609(CHEMBL3394074 | US9321756, 206)
Affinity DataIC50:  1.75nM. Assay description: The assay for the determination of Pim activity is based on the formation of phosphorylated biotinylated-BAD peptide at the Serine 112 residue (S112)...
In DepthDetails US Patent
TargetSerine/threonine-protein kinase pim-2(Homo sapiens (Human))
Amgen
US Patent
LigandPNGBDBM50061609(CHEMBL3394074 | US9321756, 206)
Affinity DataIC50:  9.65nM. Assay description: The assay for the determination of Pim activity is based on the formation of phosphorylated biotinylated-BAD peptide at the Serine 112 residue (S112)...
In DepthDetails US Patent
TargetSerine/threonine-protein kinase pim-1(Homo sapiens (Human))
Amgen
US Patent
LigandPNGBDBM50061609(CHEMBL3394074 | US9321756, 206)
Affinity DataIC50:  2nM. Assay description: Inhibition of full length recombinant PIM1 (unknown origin) using biotinylated-BAD peptide as substrate assessed as phosphorylation at serine 112 aft...
In DepthDetails ArticlePubMed
TargetSerine/threonine-protein kinase pim-3(Homo sapiens (Human))
Amgen
US Patent
LigandPNGBDBM50061609(CHEMBL3394074 | US9321756, 206)
Affinity DataIC50:  1nM. Assay description: Inhibition of full length recombinant PIM3 (unknown origin) using biotinylated-BAD peptide as substrate assessed as phosphorylation at serine 112 aft...
In DepthDetails ArticlePubMed
TargetSerine/threonine-protein kinase pim-2(Homo sapiens (Human))
Amgen
US Patent
LigandPNGBDBM50061609(CHEMBL3394074 | US9321756, 206)
Affinity DataIC50:  945nM. Assay description: Inhibition of PIM2 in human U2OS cells assessed as phosphorylation of BAD
In DepthDetails ArticlePubMed
TargetSerine/threonine-protein kinase pim-1(Homo sapiens (Human))
Amgen
US Patent
LigandPNGBDBM50061609(CHEMBL3394074 | US9321756, 206)
Affinity DataIC50:  40nM. Assay description: Inhibition of PIM1 in human U2OS cells assessed as phosphorylation of BAD
In DepthDetails ArticlePubMed
TargetSerine/threonine-protein kinase pim-2(Homo sapiens (Human))
Amgen
US Patent
LigandPNGBDBM50061609(CHEMBL3394074 | US9321756, 206)
Affinity DataIC50:  10nM. Assay description: Inhibition of full length recombinant PIM2 (unknown origin) using biotinylated-BAD peptide as substrate assessed as phosphorylation at serine 112 aft...
In DepthDetails ArticlePubMed