BDBM50061635 (S)-2-(3,4-Dihydro-1H-isoquinolin-2-ylmethyl)-chroman-7-ol; oxalic acid::CHEMBL135725
SMILES Oc1ccc2CC[C@@H](CN3CCc4ccccc4C3)Oc2c1
InChI Key InChIKey=IWUPLAFLTUWLMF-SFHVURJKSA-N
Data  6 KI
  Tab Delimited (TSV)   2D SDfile   Computed 3D by Vconf -m prep SDfile
Find this compound or compounds like it in BindingDB:
Activity Spreadsheet -- Enzyme Inhibition Constant Data from BindingDB
Found 6 hits for monomerid = 50061635
TargetD(3) dopamine receptor(Homo sapiens (Human))
Wyeth-Ayerst Research Laboratories
Curated by ChEMBL
LigandPNGBDBM50061635((S)-2-(3,4-Dihydro-1H-isoquinolin-2-ylmethyl)-chro...)
Affinity DataKi:  1nM. Assay description: Binding affinity at human Dopamine receptor D3 (hD3) using [3H]spiperone radioligand.
In DepthDetails ArticlePubMed
TargetD(2) dopamine receptor(Rattus norvegicus (rat))
Wyeth-Ayerst Research Laboratories
Curated by ChEMBL
LigandPNGBDBM50061635((S)-2-(3,4-Dihydro-1H-isoquinolin-2-ylmethyl)-chro...)
Affinity DataKi:  40nM. Assay description: In vitro binding affinity to rat striatal Dopamine receptor D2 was determined using the agonist [3H]quinpirole to label the high affinity state (D2 h...
In DepthDetails ArticlePubMed
TargetD(2) dopamine receptor(Homo sapiens (Human))
Wyeth-Ayerst Research Laboratories
Curated by ChEMBL
LigandPNGBDBM50061635((S)-2-(3,4-Dihydro-1H-isoquinolin-2-ylmethyl)-chro...)
Affinity DataKi:  74nM. Assay description: Binding affinity at human Dopamine receptor D2 (hD2) using [3H]spiperone radioligand.
In DepthDetails ArticlePubMed
TargetD(2) dopamine receptor(Rattus norvegicus (rat))
Wyeth-Ayerst Research Laboratories
Curated by ChEMBL
LigandPNGBDBM50061635((S)-2-(3,4-Dihydro-1H-isoquinolin-2-ylmethyl)-chro...)
Affinity DataKi:  110nM. Assay description: In vitro binding affinity to rat striatal Dopamine receptor D2 was determined using the antagonist [3H]spiperone + GTP to label the low affinity stat...
In DepthDetails ArticlePubMed
TargetD(4) dopamine receptor(Homo sapiens (Human))
Wyeth-Ayerst Research Laboratories
Curated by ChEMBL
LigandPNGBDBM50061635((S)-2-(3,4-Dihydro-1H-isoquinolin-2-ylmethyl)-chro...)
Affinity DataKi:  292nM. Assay description: Binding affinity at human Dopamine receptor D4 (hD4) using [3H]spiperone radioligand.
In DepthDetails ArticlePubMed
Target5-hydroxytryptamine receptor 1A(Rattus norvegicus (rat))
Wyeth-Ayerst Research Laboratories
Curated by ChEMBL
LigandPNGBDBM50061635((S)-2-(3,4-Dihydro-1H-isoquinolin-2-ylmethyl)-chro...)
Affinity DataKi:  635nM. Assay description: In vitro binding affinity to rat hippocampal 5-hydroxytryptamine 1A receptor was determined using [3H]8-OH-DPAT as radioligand
In DepthDetails ArticlePubMed