BDBM50061727 CHEMBL3394193
SMILES Cc1ccc(CC(=O)N2CCC3(CN(C3)[C@@H]3CCc4cc(ccc34)-c3cc(C)ncn3)CC2)nc1
InChI Key InChIKey=IFFQMYNBTIKRNQ-HHHXNRCGSA-N
Data  1 KI
  Tab Delimited (TSV)   2D SDfile   Computed 3D by Vconf -m prep SDfile
Find this compound or compounds like it in BindingDB:
Activity Spreadsheet -- Enzyme Inhibition Constant Data from BindingDB
Found 1 hit for monomerid = 50061727
TargetGrowth hormone secretagogue receptor type 1(Homo sapiens (Human))
Pfizer
Curated by ChEMBL
LigandPNGBDBM50061727(CHEMBL3394193)
Affinity DataKi:  49nM. Assay description: Displacement of [125I]Ghrelin from human GHS-R1a expressed in HEK293 cells after 8 hrs by SPA method
In DepthDetails ArticlePubMed