BDBM50061791 CHEMBL545544::N'-(2-Chloro-3-ethyl-5-methyl-phenyl)-N-(3-ethyl-phenyl)-N-methyl-guanidine; hydrochloride
SMILES CCc1cccc(c1)N(C)C(N)=Nc1cc(C)cc(CC)c1Cl
InChI Key InChIKey=RLYPJVUBROZKFI-UHFFFAOYSA-N
Data  1 IC50
  Tab Delimited (TSV)   2D SDfile   Computed 3D by Vconf -m prep SDfile
Find this compound or compounds like it in BindingDB:
Activity Spreadsheet -- Enzyme Inhibition Constant Data from BindingDB
Found 1 hit for monomerid = 50061791
TargetSigma non-opioid intracellular receptor 1(Homo sapiens (Human))
Cambridge Neuroscience
Curated by ChEMBL
LigandPNGBDBM50061791(CHEMBL545544 | N'-(2-Chloro-3-ethyl-5-methyl-pheny...)
Affinity DataIC50:  45nM. Assay description: Binding assay for the sigma receptor sites is performed by utilizing [3H]N,N-di-o-tolylguanidine ([3H]DTG) and guinea pig brain membrane suspensions
In DepthDetails ArticlePubMed