BDBM50062047 6-(4-Fluoro-phenyl)-3-[4-(2-methyl-imidazo[4,5-c]pyridin-5-ylmethyl)-benzoyl]-indole-1-carboxylic acid dimethylamide::CHEMBL366987
SMILES CN(C)C(=O)n1cc(C(=O)c2ccc(Cn3ccc4nc(C)nc4c3)cc2)c2ccc(cc12)-c1ccc(F)cc1
InChI Key InChIKey=NQTAJTHUYLXWAO-UHFFFAOYSA-N
Data  1 KI
  Tab Delimited (TSV)   2D SDfile   Computed 3D by Vconf -m prep SDfile
Find this compound or compounds like it in BindingDB:
Activity Spreadsheet -- Enzyme Inhibition Constant Data from BindingDB
Found 1 hit for monomerid = 50062047
TargetPlatelet-activating factor receptor(Cavia porcellus)
Abbott Laboratories
Curated by ChEMBL
LigandPNGBDBM50062047(6-(4-Fluoro-phenyl)-3-[4-(2-methyl-imidazo[4,5-c]p...)
Affinity DataKi: >1.00E+3nM. Assay description: Binding potency against Platelet activating factor (PAF) receptor using [3H]-C18-PAF as radioligand on rabbit platelet membranes
In DepthDetails ArticlePubMed