BDBM50062050 1-Dimethylcarbamoyl-3-[4-(2-methyl-imidazo[4,5-c]pyridin-3-ylmethyl)-benzoyl]-1H-indole-4-carboxylic acid methyl ester::CHEMBL173471
SMILES COC(=O)c1cccc2n(cc(C(=O)c3ccc(Cn4c(C)nc5ccncc45)cc3)c12)C(=O)N(C)C
InChI Key InChIKey=NWXZGUNKHNSQRC-UHFFFAOYSA-N
Data  1 KI
  Tab Delimited (TSV)   2D SDfile   Computed 3D by Vconf -m prep SDfile
Find this compound or compounds like it in BindingDB:
Activity Spreadsheet -- Enzyme Inhibition Constant Data from BindingDB
Found 1 hit for monomerid = 50062050
TargetPlatelet-activating factor receptor(Cavia porcellus)
Abbott Laboratories
Curated by ChEMBL
LigandPNGBDBM50062050(1-Dimethylcarbamoyl-3-[4-(2-methyl-imidazo[4,5-c]p...)
Affinity DataKi:  16nM. Assay description: Binding potency against Platelet activating factor (PAF) receptor using [3H]-C18-PAF as radioligand on rabbit platelet membranes
In DepthDetails ArticlePubMed