BDBM50062076 6-(4-Fluoro-phenyl)-3-{4-[2-(2-methyl-imidazo[4,5-c]pyridin-1-yl)-ethyl]-piperazine-1-carbonyl}-indole-1-carboxylic acid dimethylamide::CHEMBL275912
SMILES CN(C)C(=O)n1cc(C(=O)N2CCN(CCn3c(C)nc4cnccc34)CC2)c2ccc(cc12)-c1ccc(F)cc1
InChI Key InChIKey=QPAOGZQDABNROT-UHFFFAOYSA-N
Data  1 KI
  Tab Delimited (TSV)   2D SDfile   Computed 3D by Vconf -m prep SDfile
Find this compound or compounds like it in BindingDB:
Activity Spreadsheet -- Enzyme Inhibition Constant Data from BindingDB
Found 1 hit for monomerid = 50062076
TargetPlatelet-activating factor receptor(Cavia porcellus)
Abbott Laboratories
Curated by ChEMBL
LigandPNGBDBM50062076(6-(4-Fluoro-phenyl)-3-{4-[2-(2-methyl-imidazo[4,5-...)
Affinity DataKi:  39nM. Assay description: Binding potency against Platelet activating factor (PAF) receptor using [3H]-C18-PAF as radioligand on rabbit platelet membranes
In DepthDetails ArticlePubMed