BDBM50062099 4-Fluoro-3-[4-(2-methyl-imidazo[4,5-c]pyridin-1-ylmethyl)-benzoyl]-indole-1-carboxylic acid dimethylamide::CHEMBL367295
SMILES CN(C)C(=O)n1cc(C(=O)c2ccc(Cn3c(C)nc4cnccc34)cc2)c2c(F)cccc12
InChI Key InChIKey=UUBPYGSOQDUUAD-UHFFFAOYSA-N
Data  1 KI
  Tab Delimited (TSV)   2D SDfile   Computed 3D by Vconf -m prep SDfile
Find this compound or compounds like it in BindingDB:
Activity Spreadsheet -- Enzyme Inhibition Constant Data from BindingDB
Found 1 hit for monomerid = 50062099
TargetPlatelet-activating factor receptor(Cavia porcellus)
Abbott Laboratories
Curated by ChEMBL
LigandPNGBDBM50062099(4-Fluoro-3-[4-(2-methyl-imidazo[4,5-c]pyridin-1-yl...)
Affinity DataKi:  5.10nM. Assay description: Binding potency against Platelet activating factor (PAF) receptor using [3H]-C18-PAF as radioligand on rabbit platelet membranes
In DepthDetails ArticlePubMed