BDBM50062359 CHEMBL3397295
SMILES COCCCNc1cc(nc(n1)-c1cccnc1)-c1cnc(C)nc1-c1ccc(Cl)cc1Cl
InChI Key InChIKey=PCUMQXFPJRZXRS-UHFFFAOYSA-N
Data  1 IC50
  Tab Delimited (TSV)   2D SDfile   Computed 3D by Vconf -m prep SDfile
Find this compound or compounds like it in BindingDB:
Activity Spreadsheet -- Enzyme Inhibition Constant Data from BindingDB
Found 1 hit for monomerid = 50062359
TargetProto-oncogene tyrosine-protein kinase ROS(Homo sapiens (Human))
Korea University Of Science And Technology
Curated by ChEMBL
LigandPNGBDBM50062359(CHEMBL3397295)
Affinity DataIC50:  357nM. Assay description: Inhibition of ROS1 (unknown origin) incubated for 20 mins followed by [33P]ATP addition measured after 120 mins by HotSpot assay
In DepthDetails ArticlePubMed