BDBM50062382 CHEMBL3397285
SMILES COc1cc(C)cc(c1)-c1nn(CC#N)cc1-c1cc(NCCCO)nc(n1)-c1cccnc1
InChI Key InChIKey=GOIJYANVURFOJS-UHFFFAOYSA-N
Data  3 IC50
  Tab Delimited (TSV)   2D SDfile   Computed 3D by Vconf -m prep SDfile
Find this compound or compounds like it in BindingDB:
Activity Spreadsheet -- Enzyme Inhibition Constant Data from BindingDB
Found 3 hits for monomerid = 50062382
TargetProto-oncogene tyrosine-protein kinase ROS(Homo sapiens (Human))
Korea University Of Science And Technology
Curated by ChEMBL
LigandPNGBDBM50062382(CHEMBL3397285)
Affinity DataIC50:  5.09E+4nM. Assay description: Inhibition of ROS1 in human HCC78 cells after 48 hrs by CellTitre-Glo assay
In DepthDetails ArticlePubMed
TargetALK tyrosine kinase receptor(Homo sapiens (Human))
Korea University Of Science And Technology
Curated by ChEMBL
LigandPNGBDBM50062382(CHEMBL3397285)
Affinity DataIC50:  4.32E+3nM. Assay description: Inhibition of ALK (unknown origin) incubated for 20 mins followed by [33P]ATP addition measured after 120 mins by HotSpot assay
In DepthDetails ArticlePubMed
TargetProto-oncogene tyrosine-protein kinase ROS(Homo sapiens (Human))
Korea University Of Science And Technology
Curated by ChEMBL
LigandPNGBDBM50062382(CHEMBL3397285)
Affinity DataIC50:  119nM. Assay description: Inhibition of ROS1 (unknown origin) incubated for 20 mins followed by [33P]ATP addition measured after 120 mins by HotSpot assay
In DepthDetails ArticlePubMed