BDBM50062492 CHEMBL3397420
SMILES C[C@@H](O)[C@H](NC(=O)[C@H](C)NC(=O)[C@H](CCc1ccccc1)NC(=O)[C@@H]1CCCN1C(=O)[C@H](CO)NC(=O)[C@@H]1CCCN1C(C)=O)C(=O)N[C@@H](CS)C(N)=O
InChI Key InChIKey=MOAXITMHRSARBG-OXZUWUJFSA-N
Data  1 Kd
  Tab Delimited (TSV)   2D SDfile   Computed 3D by Vconf -m prep SDfile
Find this compound or compounds like it in BindingDB:
Activity Spreadsheet -- Enzyme Inhibition Constant Data from BindingDB
Found 1 hit for monomerid = 50062492
TargetThiol:disulfide interchange protein DsbA(Escherichia coli (strain K12))
University Of Queensland
Curated by ChEMBL
LigandPNGBDBM50062492(CHEMBL3397420)
Affinity DataKd:  1.49E+4nM. Assay description: Binding affinity to oxidized Escherichia coli DsbA by isothermal titration calorimetry assay
In DepthDetails ArticlePubMed