BDBM50062692 (E)-3-[(Bicyclohexyl-4-carbonyl)-amino]-2-(3-carbamimidoyl-benzyl)-5-phenyl-pent-4-enoic acid methyl ester::CHEMBL138378
SMILES COC(=O)C(Cc1cccc(c1)C(N)=N)C(NC(=O)C1CCC(CC1)C1CCCCC1)\C=C\c1ccccc1
InChI Key InChIKey=JNGAIJYLBCTUCM-HMMYKYKNSA-N
Data  1 IC50
  Tab Delimited (TSV)   2D SDfile   Computed 3D by Vconf -m prep SDfile
Find this compound or compounds like it in BindingDB:
Activity Spreadsheet -- Enzyme Inhibition Constant Data from BindingDB
Found 1 hit for monomerid = 50062692
TargetCoagulation factor X(Homo sapiens (Human))
Collegeville
Curated by ChEMBL
LigandPNGBDBM50062692((E)-3-[(Bicyclohexyl-4-carbonyl)-amino]-2-(3-carba...)
Affinity DataIC50:  1.12E+3nM. Assay description: Inhibitory activity against human Coagulation factor X
In DepthDetails ArticlePubMed