BDBM50062703 (E)-(2S,3R)-3-Benzoylamino-2-(3-carbamimidoyl-benzyl)-5-phenyl-pent-4-enoic acid methyl ester::CHEMBL140987
SMILES COC(=O)[C@@H](Cc1cccc(c1)C(N)=N)[C@H](NC(=O)c1ccccc1)\C=C\c1ccccc1
InChI Key InChIKey=ZMOPMAIWSBRIMS-PMZGJIOCSA-N
Data  1 IC50
  Tab Delimited (TSV)   2D SDfile   Computed 3D by Vconf -m prep SDfile
Find this compound or compounds like it in BindingDB:
Activity Spreadsheet -- Enzyme Inhibition Constant Data from BindingDB
Found 1 hit for monomerid = 50062703
TargetCoagulation factor X(Homo sapiens (Human))
Collegeville
Curated by ChEMBL
LigandPNGBDBM50062703((E)-(2S,3R)-3-Benzoylamino-2-(3-carbamimidoyl-benz...)
Affinity DataIC50:  2.00E+3nM. Assay description: Inhibitory activity against human Coagulation factor X
In DepthDetails ArticlePubMed