BDBM50062708 (E)-2-(3-Carbamimidoyl-benzyl)-3-[(4'-methoxy-biphenyl-4-carbonyl)-amino]-5-phenyl-pent-4-enoic acid methyl ester::CHEMBL342831
SMILES COC(=O)C(Cc1cccc(c1)C(N)=N)C(NC(=O)c1ccc(cc1)-c1ccc(OC)cc1)\C=C\c1ccccc1
InChI Key InChIKey=GUMNUIVKTFMZDK-RGVLZGJSSA-N
Data  3 IC50
  Tab Delimited (TSV)   2D SDfile   Computed 3D by Vconf -m prep SDfile
Find this compound or compounds like it in BindingDB:
Activity Spreadsheet -- Enzyme Inhibition Constant Data from BindingDB
Found 3 hits for monomerid = 50062708
TargetProthrombin(Homo sapiens (Human))
Collegeville
Curated by ChEMBL
LigandPNGBDBM50062708((E)-2-(3-Carbamimidoyl-benzyl)-3-[(4'-methoxy-biph...)
Affinity DataIC50:  2.70E+3nM. Assay description: Inhibitory activity against human Thrombin
In DepthDetails ArticlePubMed
TargetSerine protease 1/Trypsin-2(Homo sapiens (Human))
Collegeville
Curated by ChEMBL
LigandPNGBDBM50062708((E)-2-(3-Carbamimidoyl-benzyl)-3-[(4'-methoxy-biph...)
Affinity DataIC50:  2.90E+3nM. Assay description: Inhibitory activity against bovine trypsin
In DepthDetails ArticlePubMed
TargetCoagulation factor X(Homo sapiens (Human))
Collegeville
Curated by ChEMBL
LigandPNGBDBM50062708((E)-2-(3-Carbamimidoyl-benzyl)-3-[(4'-methoxy-biph...)
Affinity DataIC50:  80nM. Assay description: Inhibitory activity against human Coagulation factor X
In DepthDetails ArticlePubMed