BDBM50062717 (E)-2-(3-Carbamimidoyl-benzyl)-3-(4-methyl-benzoylamino)-5-phenyl-pent-4-enoic acid methyl ester::CHEMBL141983
SMILES COC(=O)C(Cc1cccc(c1)C(N)=N)C(NC(=O)c1ccc(C)cc1)\C=C\c1ccccc1
InChI Key InChIKey=WARQBRAPFLKGEM-DTQAZKPQSA-N
Data  1 IC50
  Tab Delimited (TSV)   2D SDfile   Computed 3D by Vconf -m prep SDfile
Find this compound or compounds like it in BindingDB:
Activity Spreadsheet -- Enzyme Inhibition Constant Data from BindingDB
Found 1 hit for monomerid = 50062717
TargetCoagulation factor X(Homo sapiens (Human))
Collegeville
Curated by ChEMBL
LigandPNGBDBM50062717((E)-2-(3-Carbamimidoyl-benzyl)-3-(4-methyl-benzoyl...)
Affinity DataIC50:  600nM. Assay description: Inhibitory activity against human Coagulation factor X
In DepthDetails ArticlePubMed