BDBM50062908 Acetic acid {[3-(3-bromo-2-methyl-imidazo[1,2-a]pyridin-8-yloxymethyl)-2,4-dichloro-phenyl]-methyl-carbamoyl}-methyl ester::CHEMBL154682
SMILES CN(C(=O)COC(C)=O)c1ccc(Cl)c(COc2cccn3c(Br)c(C)nc23)c1Cl
InChI Key InChIKey=HQGKWHKCTUTKFQ-UHFFFAOYSA-N
Data  1 IC50
  Tab Delimited (TSV)   2D SDfile   Computed 3D by Vconf -m prep SDfile
Find this compound or compounds like it in BindingDB:
Activity Spreadsheet -- Enzyme Inhibition Constant Data from BindingDB
Found 1 hit for monomerid = 50062908
TargetB2 bradykinin receptor(Cavia porcellus)
Fujisawa Pharmaceutical
Curated by ChEMBL
LigandPNGBDBM50062908(Acetic acid {[3-(3-bromo-2-methyl-imidazo[1,2-a]py...)
Affinity DataIC50:  500nM. Assay description: In vitro for inhibition of specific binding of [3H]BK (0.06 nM) to bradykinin receptor B2 in guinea pig ileum membrane preparations.
In DepthDetails ArticlePubMed